Quality Testing

Quality is delighting customers

Telecom / Wireless / Mobile Testing (134)

Discussions Replies Latest Activity

Spotlight on Talend

As the move to the next generation of integration platforms grows momentum, the need to implement a proven and scalable technology is criti…

Started by micahwilliams

0 Aug 30, 2018

Unable to launch WebDriverAgent because of xcodebuild failure: "xcodebuild failed with code 65

I am also facing the issue " Unable to launch WebDriverAgent because of xcodebuild failure: "xcodebuild failed with code 65". ", while runn…

Started by Madhavi Latha

1 Aug 6, 2018
Reply by armate arjun

Mobile App Testing - 50% discount on all packages

3 years back pCloudy came into existence to disrupt the mobile app testing eco-space. We are proud to say that today we have achieved 50000…

Started by Mallikharjun

0 Jun 22, 2018

Send Readings of wireless Sensor to google docs

Hey I wanted to connect the wireless temperature sensor interface with raspberry pi as of basic start I wanted to send the readings to goog…

Started by Jacob

0 Jun 19, 2018

Resouces for Mobile Testing

Hi, Please provide the resources for Mobile Testing for beginners. Thanks& Regards, Niranjan Rathnam G.

Started by Niranjan Rathnam

4 Jun 7, 2018
Reply by Anand Singh

Can anyone suggest a good automation tool for mobile testing?

Can anyone suggest a good automation tool for mobile testing??

Started by Gautam Mahapatra

9 May 31, 2018
Reply by Alisha Henderson

org.openqa.selenium.NoSuchSessionException: A session is either terminated or not started

I am getting  below error while running multiple test cases in Appium. Time elapsed: 0.227 s  <<< FAILURE!org.openqa.selenium.NoSu…

Started by Sandhya

1 Apr 27, 2018
Reply by Maha

Porting part of Selenium IDE to chrome extension?

Hi, I have been endeavoring to port Selenium IDE into a chrome expansion I have been dealing with yet without any result. In particular, I…

Started by priya eeranagula

0 Apr 16, 2018

Unable to run Maven project in Appium, always showing BUILD FAILURE

Can any one help me. Error:  [INFO] Scanning for projects...[INFO] [INFO] -----------------------------------------------------------------…

Started by Madhavi Latha

0 Apr 10, 2018

Issue in POM in Appium

Query in POM in Appium, please check the below code and correct me,thing going wrong App Details:  public class AppDetails { public Android…

Started by Sandhya

0 Apr 7, 2018

RSS

TTWT Magazine


Advertisement

Advertisement

Advertisement

Advertisement

© 2021   Created by Quality Testing.   Powered by

Badges  |  Report an Issue  |  Terms of Service