Quality Testing

Quality is delighting customers

Telecom / Wireless / Mobile Testing (125)

Discussions Replies Latest Activity

How to run a test case in two different devices using Appium?

Currently, I am able to run my test suite in one device only.  I want to run same test case in multiple devices. How to do that? Anyone hav…

Started by Madhavi Latha

1 7 hours ago
Reply by Nick Karlsson

Mobile App Testing - 50% discount on all packages

3 years back pCloudy came into existence to disrupt the mobile app testing eco-space. We are proud to say that today we have achieved 50000…

Started by Shankar Anamalla

0 Jun 22

Send Readings of wireless Sensor to google docs

Hey I wanted to connect the wireless temperature sensor interface with raspberry pi as of basic start I wanted to send the readings to goog…

Started by Jacob

0 Jun 19

Difference Between mobile Testing and Telecome testing.

Is any difference between Mobile Testing and Telecome Testing ? Please can anyone provide me the Interview Questions or URL related Mobile/…

Started by Rahul

1 Jun 11
Reply by Alisha Henderson

Resouces for Mobile Testing

Hi, Please provide the resources for Mobile Testing for beginners. Thanks& Regards, Niranjan Rathnam G.

Started by Niranjan Rathnam

4 Jun 7
Reply by Anand Singh

Can anyone suggest a good automation tool for mobile testing?

Can anyone suggest a good automation tool for mobile testing??

Started by Gautam Mahapatra

9 May 31
Reply by Alisha Henderson

How to test Mobile Applications?

How to test Mobile Applications? Is there any process to check functionality/ security/ performance testing? Please help me Thanks, Namra…

Started by Namrata Mishara

10 Apr 27
Reply by Alisha Henderson

org.openqa.selenium.NoSuchSessionException: A session is either terminated or not started

I am getting  below error while running multiple test cases in Appium. Time elapsed: 0.227 s  <<< FAILURE!org.openqa.selenium.NoSu…

Started by Sandhya

1 Apr 27
Reply by Maha

Porting part of Selenium IDE to chrome extension?

Hi, I have been endeavoring to port Selenium IDE into a chrome expansion I have been dealing with yet without any result. In particular, I…

Started by priya eeranagula

0 Apr 16

Unable to run Maven project in Appium, always showing BUILD FAILURE

Can any one help me. Error:  [INFO] Scanning for projects...[INFO] [INFO] -----------------------------------------------------------------…

Started by Madhavi Latha

0 Apr 10

RSS

TTWT Magazine


Advertisement

Advertisement

Advertisement

Advertisement

© 2018   Created by Quality Testing.   Powered by

Badges  |  Report an Issue  |  Terms of Service